nixbot

builds

tmayoff/wren build #26 failed

branch main · commit e16db4fdae · · took 3m 15s · eval 9s

1 failed
failed attributes
status attribute duration
failed checks.x86_64-linux.tests 3m 5s
wren: 88% tests passed, 1 tests failed out of 8 Total Test time (real) = 1.59 sec The following tests FAILED: 1 - binary_reader (Failed) Errors while runni …
wren:
88% tests passed, 1 tests failed out of 8
Total Test time (real) =   1.59 sec
The following tests FAILED:
	  1 - binary_reader (Failed)
Errors while running CTest
FAILED: [code=8] CMakeFiles/test.util 
cd /build/7c340nczgrva97nc6azys5pd8g4mjl7k-source/build && /nix/store/c3bm9h7k398cmg00d4rss6hcxkl2zbl2-cmake-4.4.2/bin/ctest
ninja: build stopped: subcommand failed.
2 succeeded
succeeded attributes
status attribute duration
loading…