wren:
88% tests passed, 1 tests failed out of 8
Total Test time (real) = 0.77 sec
The following tests FAILED:
1 - binary_reader (Failed)
Errors while runni …
wren:
88% tests passed, 1 tests failed out of 8
Total Test time (real) = 0.77 sec
The following tests FAILED:
1 - binary_reader (Failed)
Errors while running CTest
FAILED: [code=8] CMakeFiles/test.util
cd /build/dc7x4b3lyfirc87xg1z3c0b0sj4jqzcs-source/build && /nix/store/c3bm9h7k398cmg00d4rss6hcxkl2zbl2-cmake-4.4.2/bin/ctest
ninja: build stopped: subcommand failed.
|