wren:
88% tests passed, 1 tests failed out of 8
Total Test time (real) = 0.77 sec
The following tests FAILED:
1 - binary_reader (Failed)
Errors while runni …
wren:
88% tests passed, 1 tests failed out of 8
Total Test time (real) = 0.77 sec
The following tests FAILED:
1 - binary_reader (Failed)
Errors while running CTest
FAILED: [code=8] CMakeFiles/test.util
cd /build/k0yfprxyrzj7mkv26i368pc25c3wfzy3-source/build && /nix/store/c3bm9h7k398cmg00d4rss6hcxkl2zbl2-cmake-4.4.2/bin/ctest
ninja: build stopped: subcommand failed.
|