wren:
88% tests passed, 1 tests failed out of 8
Total Test time (real) = 1.85 sec
The following tests FAILED:
1 - binary_reader (Failed)
Errors while runni …
wren:
88% tests passed, 1 tests failed out of 8
Total Test time (real) = 1.85 sec
The following tests FAILED:
1 - binary_reader (Failed)
Errors while running CTest
FAILED: [code=8] CMakeFiles/test.util
cd /build/7glcaph58aisv18ndhpn6h238jfjih0h-source/build && /nix/store/c3bm9h7k398cmg00d4rss6hcxkl2zbl2-cmake-4.4.2/bin/ctest
ninja: build stopped: subcommand failed.
|