wren
checks.x86_64-linux.tests
· build #27
· raw
unpackPhase
1unpacking source archive /nix/store/61whk6bc472n1l8ihdyrss3jm3ib6g5d-k0yfprxyrzj7mkv26i368pc25c3wfzy3-source2source root is k0yfprxyrzj7mkv26i368pc25c3wfzy3-sourceconfigurePhase
3cmake flags: -GNinja -DCMAKE_FIND_USE_SYSTEM_PACKAGE_REGISTRY=OFF -DCMAKE_FIND_USE_PACKAGE_REGISTRY=OFF -DCMAKE_EXPORT_NO_PACKAGE_REGISTRY=ON -DCMAKE_BUILD_TYPE=Release -DCMAKE_INSTALL_LOCALEDIR=/nix/store/7ym2qccrcfx6id66430div4xsr3rz7sk-wren/share/locale -DCMAKE_INSTALL_LIBEXECDIR=/nix/store/7ym2qccrcfx6id66430div4xsr3rz7sk-wren/libexec -DCMAKE_INSTALL_LIBDIR=/nix/store/7ym2qccrcfx6id66430div4xsr3rz7sk-wren/lib -DCMAKE_INSTALL_DOCDIR=/nix/store/7ym2qccrcfx6id66430div4xsr3rz7sk-wren/share/doc/wren_tests -DCMAKE_INSTALL_INFODIR=/nix/store/7ym2qccrcfx6id66430div4xsr3rz7sk-wren/share/info -DCMAKE_INSTALL_MANDIR=/nix/store/7ym2qccrcfx6id66430div4xsr3rz7sk-wren/share/man -DCMAKE_INSTALL_INCLUDEDIR=/nix/store/7ym2qccrcfx6id66430div4xsr3rz7sk-wren/include -DCMAKE_INSTALL_SBINDIR=/nix/store/7ym2qccrcfx6id66430div4xsr3rz7sk-wren/sbin -DCMAKE_INSTALL_BINDIR=/nix/store/7ym2qccrcfx6id66430div4xsr3rz7sk-wren/bin -DCMAKE_INSTALL_NAME_DIR=/nix/store/7ym2qccrcfx6id66430div4xsr3rz7sk-wren/lib -DCMAKE_STRIP=/nix/store/z4c6k0mrlkwl3s4w9ysxc8vq1wylm3ms-gcc-wrapper-15.3.0/bin/strip -DCMAKE_RANLIB=/nix/store/z4c6k0mrlkwl3s4w9ysxc8vq1wylm3ms-gcc-wrapper-15.3.0/bin/ranlib -DCMAKE_AR=/nix/store/z4c6k0mrlkwl3s4w9ysxc8vq1wylm3ms-gcc-wrapper-15.3.0/bin/ar -DCMAKE_C_COMPILER=gcc -DCMAKE_CXX_COMPILER=g++ -DCMAKE_INSTALL_PREFIX=/nix/store/7ym2qccrcfx6id66430div4xsr3rz7sk-wren -DBUILD_TESTING=ON4-- The C compiler identification is GNU 15.3.05-- The CXX compiler identification is GNU 15.3.06-- Detecting C compiler ABI info7-- Detecting C compiler ABI info - done8-- Check for working C compiler: /nix/store/z4c6k0mrlkwl3s4w9ysxc8vq1wylm3ms-gcc-wrapper-15.3.0/bin/gcc - skipped9-- Detecting C compile features10-- Detecting C compile features - done11-- Detecting CXX compiler ABI info12-- Detecting CXX compiler ABI info - done13-- Check for working CXX compiler: /nix/store/z4c6k0mrlkwl3s4w9ysxc8vq1wylm3ms-gcc-wrapper-15.3.0/bin/g++ - skipped14-- Detecting CXX compile features15-- Detecting CXX compile features - done16-- Found Vulkan: /nix/store/iahmf8kl215rjcvb3zz3l7i9w2sf9x5v-vulkan-loader-1.4.357.0/lib/libvulkan.so (found version "1.4.357") missing components: glslc glslangValidator17-- Performing Test CMAKE_HAVE_LIBC_PTHREAD18-- Performing Test CMAKE_HAVE_LIBC_PTHREAD - Success19-- Found Threads: TRUE20-- Found Fontconfig: /nix/store/hrxf1fxrp7qwxrlv5k4aqxlwlam952aa-fontconfig-2.18.3-lib/lib/libfontconfig.so (found version "2.18.3")21-- Found Freetype: /nix/store/85v143gw8jcqjg04gxb38c4han2z7myb-freetype-2.14.3/lib/libfreetype.so (found version "2.14.3")22-- Configuring done (4.0s)23WARNING: Function-style preprocessor definitions may not be passed on the compiler command line because many compilers do not support it.24CMake is dropping a preprocessor definition: VULKAN_HPP_ASSERT_ON_RESULT(x)25Consider defining the macro in a (configured) header file.2627WARNING: Function-style preprocessor definitions may not be passed on the compiler command line because many compilers do not support it.28CMake is dropping a preprocessor definition: VULKAN_HPP_ASSERT_ON_RESULT(x)29Consider defining the macro in a (configured) header file.3031WARNING: Function-style preprocessor definitions may not be passed on the compiler command line because many compilers do not support it.32CMake is dropping a preprocessor definition: VULKAN_HPP_ASSERT_ON_RESULT(x)33Consider defining the macro in a (configured) header file.3435WARNING: Function-style preprocessor definitions may not be passed on the compiler command line because many compilers do not support it.36CMake is dropping a preprocessor definition: VULKAN_HPP_ASSERT_ON_RESULT(x)37Consider defining the macro in a (configured) header file.3839WARNING: Function-style preprocessor definitions may not be passed on the compiler command line because many compilers do not support it.40CMake is dropping a preprocessor definition: VULKAN_HPP_ASSERT_ON_RESULT(x)41Consider defining the macro in a (configured) header file.4243WARNING: Function-style preprocessor definitions may not be passed on the compiler command line because many compilers do not support it.44CMake is dropping a preprocessor definition: VULKAN_HPP_ASSERT_ON_RESULT(x)45Consider defining the macro in a (configured) header file.4647WARNING: Function-style preprocessor definitions may not be passed on the compiler command line because many compilers do not support it.48CMake is dropping a preprocessor definition: VULKAN_HPP_ASSERT_ON_RESULT(x)49Consider defining the macro in a (configured) header file.5051-- Generating done (0.1s)52CMake Warning (unused-cli):53 Manually-specified variables were not used by the project:5455 CMAKE_EXPORT_NO_PACKAGE_REGISTRY56 CMAKE_INSTALL_BINDIR57 CMAKE_INSTALL_DOCDIR58 CMAKE_INSTALL_INCLUDEDIR59 CMAKE_INSTALL_INFODIR60 CMAKE_INSTALL_LIBEXECDIR61 CMAKE_INSTALL_LOCALEDIR62 CMAKE_INSTALL_MANDIR63 CMAKE_INSTALL_SBINDIR646566-- Build files have been written to: /build/k0yfprxyrzj7mkv26i368pc25c3wfzy3-source/build67cmake: enabled parallel building68cmake: enabled parallel installingbuildPhase
69build flags: -j1670[1/126] Scanning /build/k0yfprxyrzj7mkv26i368pc25c3wfzy3-source/wren_utils/src/string_reader.cpp for CXX dependencies71[2/126] Scanning /build/k0yfprxyrzj7mkv26i368pc25c3wfzy3-source/wren_utils/src/string.cpp for CXX dependencies72[3/126] Scanning /build/k0yfprxyrzj7mkv26i368pc25c3wfzy3-source/wren_math/src/geometry.cpp for CXX dependencies73[4/126] Generating CXX dyndep file wren_math/CMakeFiles/wren_math.dir/CXX.dd74[5/126] Scanning /build/k0yfprxyrzj7mkv26i368pc25c3wfzy3-source/wren_vk/src/memory.cpp for CXX dependencies75[6/126] Scanning /build/k0yfprxyrzj7mkv26i368pc25c3wfzy3-source/wren_utils/src/filesystem.cpp for CXX dependencies76[7/126] Scanning /build/k0yfprxyrzj7mkv26i368pc25c3wfzy3-source/wren/src/input.cpp for CXX dependencies77[8/126] Scanning /build/k0yfprxyrzj7mkv26i368pc25c3wfzy3-source/wren/src/event.cpp for CXX dependencies78[9/126] Generating CXX dyndep file wren_utils/CMakeFiles/wren_utils.dir/CXX.dd79[10/126] Scanning /build/k0yfprxyrzj7mkv26i368pc25c3wfzy3-source/wren_vk/src/vulkan.cpp for CXX dependencies80[11/126] Scanning /build/k0yfprxyrzj7mkv26i368pc25c3wfzy3-source/wren/src/assets/manager.cpp for CXX dependencies81[12/126] Building CXX object wren_math/CMakeFiles/wren_math.dir/src/geometry.cpp.o82[13/126] Scanning /build/k0yfprxyrzj7mkv26i368pc25c3wfzy3-source/wren/src/scene/components/collider.cpp for CXX dependencies83[14/126] Building CXX object wren_utils/CMakeFiles/wren_utils.dir/src/string_reader.cpp.o84[15/126] Scanning /build/k0yfprxyrzj7mkv26i368pc25c3wfzy3-source/wren_vk/src/image.cpp for CXX dependencies85[16/126] Scanning /build/k0yfprxyrzj7mkv26i368pc25c3wfzy3-source/wren/src/scene/scene.cpp for CXX dependencies86[17/126] Scanning /build/k0yfprxyrzj7mkv26i368pc25c3wfzy3-source/wren/src/graph.cpp for CXX dependencies87[18/126] Scanning /build/k0yfprxyrzj7mkv26i368pc25c3wfzy3-source/wren/src/graphics_context.cpp for CXX dependencies88[19/126] Scanning /build/k0yfprxyrzj7mkv26i368pc25c3wfzy3-source/wren_vk/src/buffer.cpp for CXX dependencies89[20/126] Scanning /build/k0yfprxyrzj7mkv26i368pc25c3wfzy3-source/wren_vk/src/shader.cpp for CXX dependencies90[21/126] Generating CXX dyndep file wren_vk/CMakeFiles/wren_vk.dir/CXX.dd91[22/126] Linking CXX static library wren_math/libwren_math.a92[23/126] Building CXX object wren_utils/CMakeFiles/wren_utils.dir/src/string.cpp.o93[24/126] Scanning /build/k0yfprxyrzj7mkv26i368pc25c3wfzy3-source/wren/src/mesh.cpp for CXX dependencies94[25/126] Scanning /build/k0yfprxyrzj7mkv26i368pc25c3wfzy3-source/wren/src/render_target.cpp for CXX dependencies95[26/126] Scanning /build/k0yfprxyrzj7mkv26i368pc25c3wfzy3-source/wren/src/renderer.cpp for CXX dependencies96[27/126] Scanning /build/k0yfprxyrzj7mkv26i368pc25c3wfzy3-source/wren/src/application.cpp for CXX dependencies97[28/126] Scanning /build/k0yfprxyrzj7mkv26i368pc25c3wfzy3-source/wren/src/mesh_loader.cpp for CXX dependencies98[29/126] Scanning /build/k0yfprxyrzj7mkv26i368pc25c3wfzy3-source/wren/src/render_pass.cpp for CXX dependencies99[30/126] Scanning /build/k0yfprxyrzj7mkv26i368pc25c3wfzy3-source/wren/src/scene/deserialization.cpp for CXX dependencies100[31/126] Scanning /build/k0yfprxyrzj7mkv26i368pc25c3wfzy3-source/wren/src/scene/serialization.cpp for CXX dependencies101[32/126] Scanning /build/k0yfprxyrzj7mkv26i368pc25c3wfzy3-source/wren_physics/src/ray.cpp for CXX dependencies102[33/126] Scanning /build/k0yfprxyrzj7mkv26i368pc25c3wfzy3-source/wren_utils/tests/binary_reader.cpp for CXX dependencies103[34/126] Scanning /build/k0yfprxyrzj7mkv26i368pc25c3wfzy3-source/wren_text/src/font.cpp for CXX dependencies104[35/126] Generating CXX dyndep file wren_text/CMakeFiles/wren_text.dir/CXX.dd105[36/126] Scanning /build/k0yfprxyrzj7mkv26i368pc25c3wfzy3-source/wren_utils/tests/string_reader.cpp for CXX dependencies106[37/126] Generating CXX dyndep file wren_physics/CMakeFiles/wren_physics.dir/CXX.dd107[38/126] Scanning /build/k0yfprxyrzj7mkv26i368pc25c3wfzy3-source/wren_math/tests/matrix.cpp for CXX dependencies108[39/126] Scanning /build/k0yfprxyrzj7mkv26i368pc25c3wfzy3-source/wren/src/window.cpp for CXX dependencies109[40/126] Scanning /build/k0yfprxyrzj7mkv26i368pc25c3wfzy3-source/wren/src/utils/queue.cpp for CXX dependencies110[41/126] Scanning /build/k0yfprxyrzj7mkv26i368pc25c3wfzy3-source/wren/src/utils/device.cpp for CXX dependencies111[42/126] Scanning /build/k0yfprxyrzj7mkv26i368pc25c3wfzy3-source/wren_math/tests/vector.cpp for CXX dependencies112[43/126] Scanning /build/k0yfprxyrzj7mkv26i368pc25c3wfzy3-source/wren_math/tests/geometry.cpp for CXX dependencies113[44/126] Building CXX object wren_utils/CMakeFiles/wren_utils.dir/src/filesystem.cpp.o114[45/126] Linking CXX static library wren_utils/libwren_utils.a115[46/126] Scanning /build/k0yfprxyrzj7mkv26i368pc25c3wfzy3-source/wren/src/utils/vulkan.cpp for CXX dependencies116[47/126] Generating CXX dyndep file wren/CMakeFiles/wren.dir/CXX.dd117[48/126] Scanning /build/k0yfprxyrzj7mkv26i368pc25c3wfzy3-source/wren_utils/tests/enums.cpp for CXX dependencies118[49/126] Scanning /build/k0yfprxyrzj7mkv26i368pc25c3wfzy3-source/wren_physics/tests/raycast.cpp for CXX dependencies119[50/126] Scanning /build/k0yfprxyrzj7mkv26i368pc25c3wfzy3-source/wren_gui/src/instance.cpp for CXX dependencies120[51/126] Scanning /build/k0yfprxyrzj7mkv26i368pc25c3wfzy3-source/editor/src/scene_panel.cpp for CXX dependencies121[52/126] Scanning /build/k0yfprxyrzj7mkv26i368pc25c3wfzy3-source/wren_text/tests/font.cpp for CXX dependencies122[53/126] Scanning /build/k0yfprxyrzj7mkv26i368pc25c3wfzy3-source/examples/nand/main.cpp for CXX dependencies123[54/126] Scanning /build/k0yfprxyrzj7mkv26i368pc25c3wfzy3-source/editor/src/ui.cpp for CXX dependencies124[55/126] Scanning /build/k0yfprxyrzj7mkv26i368pc25c3wfzy3-source/editor/src/main.cpp for CXX dependencies125[56/126] Scanning /build/k0yfprxyrzj7mkv26i368pc25c3wfzy3-source/editor/src/editor.cpp for CXX dependencies126[57/126] Building CXX object wren_text/CMakeFiles/wren_text.dir/src/font.cpp.o127[58/126] Building CXX object wren/CMakeFiles/wren.dir/src/event.cpp.o128[59/126] Building CXX object wren/CMakeFiles/wren.dir/src/assets/manager.cpp.o129[60/126] Building CXX object wren/CMakeFiles/wren.dir/src/input.cpp.o130[61/126] Building CXX object wren_vk/CMakeFiles/wren_vk.dir/src/memory.cpp.o131[62/126] Building CXX object wren/CMakeFiles/wren.dir/src/scene/components/collider.cpp.o132[63/126] Building CXX object wren_vk/CMakeFiles/wren_vk.dir/src/vulkan.cpp.o133[64/126] Building CXX object wren/CMakeFiles/wren.dir/src/scene/scene.cpp.o134[65/126] Building CXX object wren_vk/CMakeFiles/wren_vk.dir/src/image.cpp.o135[66/126] Building CXX object wren_vk/CMakeFiles/wren_vk.dir/src/buffer.cpp.o136[67/126] Generating CXX dyndep file wren_gui/CMakeFiles/wren_gui.dir/CXX.dd137[68/126] Scanning /build/k0yfprxyrzj7mkv26i368pc25c3wfzy3-source/editor/src/inspector_panel.cpp for CXX dependencies138[69/126] Building CXX object wren/CMakeFiles/wren.dir/src/graph.cpp.o139[70/126] Generating CXX dyndep file wren_utils/tests/CMakeFiles/binary_reader.dir/CXX.dd140[71/126] Generating CXX dyndep file wren_utils/tests/CMakeFiles/string_reader.dir/CXX.dd141[72/126] Generating CXX dyndep file wren_utils/tests/CMakeFiles/enums.dir/CXX.dd142[73/126] Generating CXX dyndep file wren_math/tests/CMakeFiles/vector.dir/CXX.dd143[74/126] Generating CXX dyndep file wren_math/tests/CMakeFiles/matrix.dir/CXX.dd144[75/126] Generating CXX dyndep file wren_math/tests/CMakeFiles/geometry.dir/CXX.dd145[76/126] Scanning /build/k0yfprxyrzj7mkv26i368pc25c3wfzy3-source/editor/src/filesystem_panel.cpp for CXX dependencies146[77/126] Generating CXX dyndep file wren_physics/tests/CMakeFiles/raycast.dir/CXX.dd147[78/126] Linking CXX static library wren_text/libwren_text.a148[79/126] Generating CXX dyndep file wren_text/tests/CMakeFiles/font.dir/CXX.dd149[80/126] Building CXX object wren/CMakeFiles/wren.dir/src/mesh.cpp.o150[81/126] Generating CXX dyndep file examples/nand/CMakeFiles/nand.dir/CXX.dd151[82/126] Generating CXX dyndep file editor/CMakeFiles/wren_editor.dir/CXX.dd152[83/126] Building CXX object wren_vk/CMakeFiles/wren_vk.dir/src/shader.cpp.o153[84/126] Linking CXX static library wren_vk/libwren_vk.a154[85/126] Building CXX object wren_physics/CMakeFiles/wren_physics.dir/src/ray.cpp.o155[86/126] Building CXX object wren/CMakeFiles/wren.dir/src/render_target.cpp.o156[87/126] Building CXX object wren/CMakeFiles/wren.dir/src/render_pass.cpp.o157[88/126] Building CXX object wren_utils/tests/CMakeFiles/binary_reader.dir/binary_reader.cpp.o158[89/126] Building CXX object wren_utils/tests/CMakeFiles/string_reader.dir/string_reader.cpp.o159[90/126] Building CXX object wren/CMakeFiles/wren.dir/src/application.cpp.o160[91/126] Building CXX object wren/CMakeFiles/wren.dir/src/utils/device.cpp.o161[92/126] Building CXX object wren/CMakeFiles/wren.dir/src/utils/queue.cpp.o162[93/126] Building CXX object wren/CMakeFiles/wren.dir/src/mesh_loader.cpp.o163[94/126] Building CXX object wren_utils/tests/CMakeFiles/enums.dir/enums.cpp.o164[95/126] Building CXX object wren/CMakeFiles/wren.dir/src/graphics_context.cpp.o165[96/126] Building CXX object wren_text/tests/CMakeFiles/font.dir/font.cpp.o166[97/126] Building CXX object wren/CMakeFiles/wren.dir/src/renderer.cpp.o167[98/126] Building CXX object wren/CMakeFiles/wren.dir/src/utils/vulkan.cpp.o168[99/126] Building CXX object wren/CMakeFiles/wren.dir/src/scene/deserialization.cpp.o169In file included from /build/k0yfprxyrzj7mkv26i368pc25c3wfzy3-source/wren/src/scene/deserialization.cpp:5:170/build/k0yfprxyrzj7mkv26i368pc25c3wfzy3-source/wren/include/wren/scene/components/mesh.hpp: In member function 'auto wren::scene::components::MeshRenderer::bind(const std::shared_ptr<wren::Context>&, const std::shared_ptr<wren::vk::Shader>&, const vk::CommandBuffer&, const wren::math::Mat4f&)':171/build/k0yfprxyrzj7mkv26i368pc25c3wfzy3-source/wren/include/wren/scene/components/mesh.hpp:45:32: warning: ignoring return value of 'constexpr std::vector< <template-parameter-1-1>, <template-parameter-1-2> >::reference std::vector< <template-parameter-1-1>, <template-parameter-1-2> >::at(size_type) [with _Tp = vk::DescriptorSet; _Alloc = std::allocator<vk::DescriptorSet>; reference = vk::DescriptorSet&; size_type = long unsigned int]', declared with attribute 'nodiscard' [-Wunused-result]172 45 | shader->desciptor_sets().at(1);173 | ~~~~~~~~~~~~~~~~~~~~~~~~~~~^~~174In file included from /nix/store/8sjgd7q3mdks1rb7rbcv0sallhvrhai5-gcc-15.3.0/include/c++/15.3.0/vector:68,175 from /nix/store/8sjgd7q3mdks1rb7rbcv0sallhvrhai5-gcc-15.3.0/include/c++/15.3.0/functional:66,176 from /nix/store/20ndisq4ywlcrcflny4fngncwp3azyqz-boost-1.89.0-dev/include/boost/algorithm/string/detail/classification.hpp:17,177 from /nix/store/20ndisq4ywlcrcflny4fngncwp3azyqz-boost-1.89.0-dev/include/boost/algorithm/string/classification.hpp:18,178 from /nix/store/20ndisq4ywlcrcflny4fngncwp3azyqz-boost-1.89.0-dev/include/boost/algorithm/string/trim.hpp:23,179 from /nix/store/20ndisq4ywlcrcflny4fngncwp3azyqz-boost-1.89.0-dev/include/boost/algorithm/string.hpp:19,180 from /build/k0yfprxyrzj7mkv26i368pc25c3wfzy3-source/wren_utils/include/wren/utils/enums.hpp:3,181 from /build/k0yfprxyrzj7mkv26i368pc25c3wfzy3-source/wren_utils/include/wren/utils/result.hpp:9,182 from /build/k0yfprxyrzj7mkv26i368pc25c3wfzy3-source/wren/include/wren/scene/deserialization.hpp:4,183 from /build/k0yfprxyrzj7mkv26i368pc25c3wfzy3-source/wren/src/scene/deserialization.cpp:1:184/nix/store/8sjgd7q3mdks1rb7rbcv0sallhvrhai5-gcc-15.3.0/include/c++/15.3.0/bits/stl_vector.h:1313:7: note: declared here185 1313 | at(size_type __n)186 | ^~187[100/126] Building CXX object editor/CMakeFiles/wren_editor.dir/src/scene_panel.cpp.o188[101/126] Linking CXX executable wren_utils/tests/string_reader189[102/126] Building CXX object wren/CMakeFiles/wren.dir/src/window.cpp.o190[103/126] Linking CXX executable wren_utils/tests/binary_reader191[104/126] Linking CXX executable wren_utils/tests/enums192[105/126] Linking CXX executable wren_text/tests/font193[106/126] Building CXX object wren/CMakeFiles/wren.dir/src/scene/serialization.cpp.o194In file included from /build/k0yfprxyrzj7mkv26i368pc25c3wfzy3-source/wren/src/scene/serialization.cpp:6:195/build/k0yfprxyrzj7mkv26i368pc25c3wfzy3-source/wren/include/wren/scene/components/mesh.hpp: In member function 'auto wren::scene::components::MeshRenderer::bind(const std::shared_ptr<wren::Context>&, const std::shared_ptr<wren::vk::Shader>&, const vk::CommandBuffer&, const wren::math::Mat4f&)':196/build/k0yfprxyrzj7mkv26i368pc25c3wfzy3-source/wren/include/wren/scene/components/mesh.hpp:45:32: warning: ignoring return value of 'constexpr std::vector< <template-parameter-1-1>, <template-parameter-1-2> >::reference std::vector< <template-parameter-1-1>, <template-parameter-1-2> >::at(size_type) [with _Tp = vk::DescriptorSet; _Alloc = std::allocator<vk::DescriptorSet>; reference = vk::DescriptorSet&; size_type = long unsigned int]', declared with attribute 'nodiscard' [-Wunused-result]197 45 | shader->desciptor_sets().at(1);198 | ~~~~~~~~~~~~~~~~~~~~~~~~~~~^~~199In file included from /nix/store/8sjgd7q3mdks1rb7rbcv0sallhvrhai5-gcc-15.3.0/include/c++/15.3.0/vector:68,200 from /nix/store/8sjgd7q3mdks1rb7rbcv0sallhvrhai5-gcc-15.3.0/include/c++/15.3.0/functional:66,201 from /nix/store/20ndisq4ywlcrcflny4fngncwp3azyqz-boost-1.89.0-dev/include/boost/algorithm/string/detail/classification.hpp:17,202 from /nix/store/20ndisq4ywlcrcflny4fngncwp3azyqz-boost-1.89.0-dev/include/boost/algorithm/string/classification.hpp:18,203 from /nix/store/20ndisq4ywlcrcflny4fngncwp3azyqz-boost-1.89.0-dev/include/boost/algorithm/string/trim.hpp:23,204 from /nix/store/20ndisq4ywlcrcflny4fngncwp3azyqz-boost-1.89.0-dev/include/boost/algorithm/string.hpp:19,205 from /build/k0yfprxyrzj7mkv26i368pc25c3wfzy3-source/wren_utils/include/wren/utils/enums.hpp:3,206 from /build/k0yfprxyrzj7mkv26i368pc25c3wfzy3-source/wren_utils/include/wren/utils/result.hpp:9,207 from /build/k0yfprxyrzj7mkv26i368pc25c3wfzy3-source/wren/include/wren/scene/serialization.hpp:4,208 from /build/k0yfprxyrzj7mkv26i368pc25c3wfzy3-source/wren/src/scene/serialization.cpp:1:209/nix/store/8sjgd7q3mdks1rb7rbcv0sallhvrhai5-gcc-15.3.0/include/c++/15.3.0/bits/stl_vector.h:1313:7: note: declared here210 1313 | at(size_type __n)211 | ^~212[107/126] Building CXX object wren_math/tests/CMakeFiles/vector.dir/vector.cpp.o213[108/126] Linking CXX static library wren/libwren.a214[109/126] Linking CXX static library wren_physics/libwren_physics.a215[110/126] Building CXX object wren_math/tests/CMakeFiles/matrix.dir/matrix.cpp.o216[111/126] Linking CXX executable wren_math/tests/vector217[112/126] Linking CXX executable wren_math/tests/matrix218[113/126] Building CXX object wren_physics/tests/CMakeFiles/raycast.dir/raycast.cpp.o219[114/126] Building CXX object wren_math/tests/CMakeFiles/geometry.dir/geometry.cpp.o220[115/126] Linking CXX executable wren_physics/tests/raycast221[116/126] Linking CXX executable wren_math/tests/geometry222[117/126] Building CXX object editor/CMakeFiles/wren_editor.dir/src/filesystem_panel.cpp.o223[118/126] Building CXX object wren_gui/CMakeFiles/wren_gui.dir/src/instance.cpp.o224[119/126] Linking CXX static library wren_gui/libwren_gui.a225[120/126] Building CXX object editor/CMakeFiles/wren_editor.dir/src/inspector_panel.cpp.o226In file included from /build/k0yfprxyrzj7mkv26i368pc25c3wfzy3-source/editor/src/inspector_panel.hpp:7,227 from /build/k0yfprxyrzj7mkv26i368pc25c3wfzy3-source/editor/src/inspector_panel.cpp:1:228/build/k0yfprxyrzj7mkv26i368pc25c3wfzy3-source/wren/include/wren/scene/components/mesh.hpp: In member function 'auto wren::scene::components::MeshRenderer::bind(const std::shared_ptr<wren::Context>&, const std::shared_ptr<wren::vk::Shader>&, const vk::CommandBuffer&, const wren::math::Mat4f&)':229/build/k0yfprxyrzj7mkv26i368pc25c3wfzy3-source/wren/include/wren/scene/components/mesh.hpp:45:32: warning: ignoring return value of 'constexpr std::vector< <template-parameter-1-1>, <template-parameter-1-2> >::reference std::vector< <template-parameter-1-1>, <template-parameter-1-2> >::at(size_type) [with _Tp = vk::DescriptorSet; _Alloc = std::allocator<vk::DescriptorSet>; reference = vk::DescriptorSet&; size_type = long unsigned int]', declared with attribute 'nodiscard' [-Wunused-result]230 45 | shader->desciptor_sets().at(1);231 | ~~~~~~~~~~~~~~~~~~~~~~~~~~~^~~232In file included from /nix/store/8sjgd7q3mdks1rb7rbcv0sallhvrhai5-gcc-15.3.0/include/c++/15.3.0/vector:68,233 from /nix/store/gj5v2ghs5pcx3h43sh3a6zrspiixl97i-vulkan-headers-1.4.357.0/include/vulkan/vulkan.hpp:26,234 from /build/k0yfprxyrzj7mkv26i368pc25c3wfzy3-source/wren/include/wren/mesh.hpp:6,235 from /build/k0yfprxyrzj7mkv26i368pc25c3wfzy3-source/wren/include/wren/scene/components/mesh.hpp:6:236/nix/store/8sjgd7q3mdks1rb7rbcv0sallhvrhai5-gcc-15.3.0/include/c++/15.3.0/bits/stl_vector.h:1313:7: note: declared here237 1313 | at(size_type __n)238 | ^~239[121/126] Building CXX object editor/CMakeFiles/wren_editor.dir/src/ui.cpp.o240/build/k0yfprxyrzj7mkv26i368pc25c3wfzy3-source/editor/src/ui.cpp: In function 'auto editor::ui::mouse_code_to_imgui(wren::MouseCode)':241/build/k0yfprxyrzj7mkv26i368pc25c3wfzy3-source/editor/src/ui.cpp:31:1: warning: control reaches end of non-void function [-Wreturn-type]242 31 | }243 | ^244/build/k0yfprxyrzj7mkv26i368pc25c3wfzy3-source/editor/src/ui.cpp: In function 'auto editor::ui::key_code_to_imgui(wren::KeyCode)':245/build/k0yfprxyrzj7mkv26i368pc25c3wfzy3-source/editor/src/ui.cpp:248:1: warning: control reaches end of non-void function [-Wreturn-type]246 248 | }247 | ^248[122/126] Building CXX object examples/nand/CMakeFiles/nand.dir/main.cpp.o249In file included from /build/k0yfprxyrzj7mkv26i368pc25c3wfzy3-source/examples/nand/main.cpp:7:250/build/k0yfprxyrzj7mkv26i368pc25c3wfzy3-source/wren/include/wren/scene/components/mesh.hpp: In member function 'auto wren::scene::components::MeshRenderer::bind(const std::shared_ptr<wren::Context>&, const std::shared_ptr<wren::vk::Shader>&, const vk::CommandBuffer&, const wren::math::Mat4f&)':251/build/k0yfprxyrzj7mkv26i368pc25c3wfzy3-source/wren/include/wren/scene/components/mesh.hpp:45:32: warning: ignoring return value of 'constexpr std::vector<_Tp, _Alloc>::reference std::vector<_Tp, _Alloc>::at(size_type) [with _Tp = vk::DescriptorSet; _Alloc = std::allocator<vk::DescriptorSet>; reference = vk::DescriptorSet&; size_type = long unsigned int]', declared with attribute 'nodiscard' [-Wunused-result]252 45 | shader->desciptor_sets().at(1);253 | ~~~~~~~~~~~~~~~~~~~~~~~~~~~^~~254In file included from /nix/store/8sjgd7q3mdks1rb7rbcv0sallhvrhai5-gcc-15.3.0/include/c++/15.3.0/vector:68,255 from /nix/store/8sjgd7q3mdks1rb7rbcv0sallhvrhai5-gcc-15.3.0/include/c++/15.3.0/functional:66,256 from /build/k0yfprxyrzj7mkv26i368pc25c3wfzy3-source/wren/include/wren/event.hpp:3,257 from /build/k0yfprxyrzj7mkv26i368pc25c3wfzy3-source/wren/include/wren/context.hpp:5,258 from /build/k0yfprxyrzj7mkv26i368pc25c3wfzy3-source/wren/include/wren/application.hpp:5,259 from /build/k0yfprxyrzj7mkv26i368pc25c3wfzy3-source/examples/nand/main.cpp:2:260/nix/store/8sjgd7q3mdks1rb7rbcv0sallhvrhai5-gcc-15.3.0/include/c++/15.3.0/bits/stl_vector.h:1313:7: note: declared here261 1313 | at(size_type __n)262 | ^~263[123/126] Building CXX object editor/CMakeFiles/wren_editor.dir/src/main.cpp.o264In file included from /build/k0yfprxyrzj7mkv26i368pc25c3wfzy3-source/editor/src/editor.hpp:14,265 from /build/k0yfprxyrzj7mkv26i368pc25c3wfzy3-source/editor/src/main.cpp:12:266/build/k0yfprxyrzj7mkv26i368pc25c3wfzy3-source/wren/include/wren/scene/components/mesh.hpp: In member function 'auto wren::scene::components::MeshRenderer::bind(const std::shared_ptr<wren::Context>&, const std::shared_ptr<wren::vk::Shader>&, const vk::CommandBuffer&, const wren::math::Mat4f&)':267/build/k0yfprxyrzj7mkv26i368pc25c3wfzy3-source/wren/include/wren/scene/components/mesh.hpp:45:32: warning: ignoring return value of 'constexpr std::vector< <template-parameter-1-1>, <template-parameter-1-2> >::reference std::vector< <template-parameter-1-1>, <template-parameter-1-2> >::at(size_type) [with _Tp = vk::DescriptorSet; _Alloc = std::allocator<vk::DescriptorSet>; reference = vk::DescriptorSet&; size_type = long unsigned int]', declared with attribute 'nodiscard' [-Wunused-result]268 45 | shader->desciptor_sets().at(1);269 | ~~~~~~~~~~~~~~~~~~~~~~~~~~~^~~270In file included from /nix/store/8sjgd7q3mdks1rb7rbcv0sallhvrhai5-gcc-15.3.0/include/c++/15.3.0/vector:68,271 from /nix/store/8sjgd7q3mdks1rb7rbcv0sallhvrhai5-gcc-15.3.0/include/c++/15.3.0/functional:66,272 from /build/k0yfprxyrzj7mkv26i368pc25c3wfzy3-source/wren/include/wren/event.hpp:3,273 from /build/k0yfprxyrzj7mkv26i368pc25c3wfzy3-source/wren/include/wren/context.hpp:5,274 from /build/k0yfprxyrzj7mkv26i368pc25c3wfzy3-source/wren/include/wren/application.hpp:5,275 from /build/k0yfprxyrzj7mkv26i368pc25c3wfzy3-source/editor/src/main.cpp:5:276/nix/store/8sjgd7q3mdks1rb7rbcv0sallhvrhai5-gcc-15.3.0/include/c++/15.3.0/bits/stl_vector.h:1313:7: note: declared here277 1313 | at(size_type __n)278 | ^~279[124/126] Linking CXX executable examples/nand/nand280[125/126] Building CXX object editor/CMakeFiles/wren_editor.dir/src/editor.cpp.o281In file included from /build/k0yfprxyrzj7mkv26i368pc25c3wfzy3-source/editor/src/editor.hpp:14,282 from /build/k0yfprxyrzj7mkv26i368pc25c3wfzy3-source/editor/src/editor.cpp:1:283/build/k0yfprxyrzj7mkv26i368pc25c3wfzy3-source/wren/include/wren/scene/components/mesh.hpp: In member function 'auto wren::scene::components::MeshRenderer::bind(const std::shared_ptr<wren::Context>&, const std::shared_ptr<wren::vk::Shader>&, const vk::CommandBuffer&, const wren::math::Mat4f&)':284/build/k0yfprxyrzj7mkv26i368pc25c3wfzy3-source/wren/include/wren/scene/components/mesh.hpp:45:32: warning: ignoring return value of 'constexpr std::vector< <template-parameter-1-1>, <template-parameter-1-2> >::reference std::vector< <template-parameter-1-1>, <template-parameter-1-2> >::at(size_type) [with _Tp = vk::DescriptorSet; _Alloc = std::allocator<vk::DescriptorSet>; reference = vk::DescriptorSet&; size_type = long unsigned int]', declared with attribute 'nodiscard' [-Wunused-result]285 45 | shader->desciptor_sets().at(1);286 | ~~~~~~~~~~~~~~~~~~~~~~~~~~~^~~287In file included from /nix/store/8sjgd7q3mdks1rb7rbcv0sallhvrhai5-gcc-15.3.0/include/c++/15.3.0/vector:68,288 from /nix/store/gj5v2ghs5pcx3h43sh3a6zrspiixl97i-vulkan-headers-1.4.357.0/include/vulkan/vulkan.hpp:26,289 from /build/k0yfprxyrzj7mkv26i368pc25c3wfzy3-source/editor/src/editor.hpp:10:290/nix/store/8sjgd7q3mdks1rb7rbcv0sallhvrhai5-gcc-15.3.0/include/c++/15.3.0/bits/stl_vector.h:1313:7: note: declared here291 1313 | at(size_type __n)292 | ^~293[126/126] Linking CXX executable editor/wren_editor294buildPhase completed in 2 minutes 46 secondscheckPhase
295check flags: -j16 test296[0/1] Running tests...297Test project /build/k0yfprxyrzj7mkv26i368pc25c3wfzy3-source/build298 Start 1: binary_reader299 Start 2: string_reader300 Start 3: enums301 Start 4: vector302 Start 5: matrix303 Start 6: geometry304 Start 7: raycast305 Start 8: font3061/8 Test #1: binary_reader ....................***Failed 0.02 sec307Running 1 test case...308/build/k0yfprxyrzj7mkv26i368pc25c3wfzy3-source/wren_utils/tests/binary_reader.cpp(48): error: in "binary_reader/Read": check num == 1234 has failed [-771489792 != 1234]309/build/k0yfprxyrzj7mkv26i368pc25c3wfzy3-source/wren_utils/tests/binary_reader.cpp(52): error: in "binary_reader/Read": check n == 1234 has failed [-771489792 != 1234]310/build/k0yfprxyrzj7mkv26i368pc25c3wfzy3-source/wren_utils/tests/binary_reader.cpp(52): error: in "binary_reader/Read": check n == 1234 has failed [-771489792 != 1234]311/build/k0yfprxyrzj7mkv26i368pc25c3wfzy3-source/wren_utils/tests/binary_reader.cpp(52): error: in "binary_reader/Read": check n == 1234 has failed [-771489792 != 1234]312313*** 4 failures are detected in the test module "binary_reader"3143153162/8 Test #2: string_reader .................... Passed 0.02 sec3173/8 Test #3: enums ............................ Passed 0.01 sec3184/8 Test #4: vector ........................... Passed 0.01 sec3195/8 Test #5: matrix ........................... Passed 0.01 sec3206/8 Test #6: geometry ......................... Passed 0.01 sec3217/8 Test #8: font ............................. Passed 0.02 sec3228/8 Test #7: raycast .......................... Passed 0.75 sec32332488% tests passed, 1 tests failed out of 8325326Total Test time (real) = 0.77 sec327328The following tests FAILED:329 1 - binary_reader (Failed)330Errors while running CTest331FAILED: [code=8] CMakeFiles/test.util 332cd /build/k0yfprxyrzj7mkv26i368pc25c3wfzy3-source/build && /nix/store/c3bm9h7k398cmg00d4rss6hcxkl2zbl2-cmake-4.4.2/bin/ctest333ninja: build stopped: subcommand failed.