setup
checks.x86_64-linux.tests
· build #26
· raw
1warning: unknown setting 'eval-cores'2warning: unknown setting 'lazy-trees'3this derivation will be built:4 /nix/store/nw0ipzp4wlp747g5ijhjicm2963fdnqm-wren.drv5error: Cannot build '/nix/store/nw0ipzp4wlp747g5ijhjicm2963fdnqm-wren.drv'.6 Reason: builder failed with exit code 8.7 Output paths:8 /nix/store/9z3302222wwkld7hcdv3yh4689k49a6r-wren9 Last 25 log lines:10 > /build/7c340nczgrva97nc6azys5pd8g4mjl7k-source/wren_utils/tests/binary_reader.cpp(52): error: in "binary_reader/Read": check n == 1234 has failed [-771489792 != 1234]11 > /build/7c340nczgrva97nc6azys5pd8g4mjl7k-source/wren_utils/tests/binary_reader.cpp(52): error: in "binary_reader/Read": check n == 1234 has failed [-771489792 != 1234]12 > /build/7c340nczgrva97nc6azys5pd8g4mjl7k-source/wren_utils/tests/binary_reader.cpp(52): error: in "binary_reader/Read": check n == 1234 has failed [-771489792 != 1234]13 >14 > *** 4 failures are detected in the test module "binary_reader"15 > 16 >17 > 2/8 Test #2: string_reader .................... Passed 0.05 sec18 > 3/8 Test #3: enums ............................ Passed 0.04 sec19 > 4/8 Test #4: vector ........................... Passed 0.04 sec20 > 5/8 Test #5: matrix ........................... Passed 0.03 sec21 > 6/8 Test #6: geometry ......................... Passed 0.03 sec22 > 7/8 Test #8: font ............................. Passed 0.06 sec23 > 8/8 Test #7: raycast .......................... Passed 1.55 sec24 >25 > 88% tests passed, 1 tests failed out of 826 >27 > Total Test time (real) = 1.59 sec28 >29 > The following tests FAILED:30 > 1 - binary_reader (Failed)31 > Errors while running CTest32 > FAILED: [code=8] CMakeFiles/test.util33 > cd /build/7c340nczgrva97nc6azys5pd8g4mjl7k-source/build && /nix/store/c3bm9h7k398cmg00d4rss6hcxkl2zbl2-cmake-4.4.2/bin/ctest34 > ninja: build stopped: subcommand failed.35 For full logs, run:36 nix log /nix/store/nw0ipzp4wlp747g5ijhjicm2963fdnqm-wren.drv