warning: unknown setting 'eval-cores' warning: unknown setting 'lazy-trees' this derivation will be built: /nix/store/9dry1g918vzrsilyschi6zgciymb52hg-wren.drv error: Cannot build '/nix/store/9dry1g918vzrsilyschi6zgciymb52hg-wren.drv'. Reason: builder failed with exit code 8. Output paths: /nix/store/drwq9m37dj89i75m00dyvf00xrn690s8-wren Last 25 log lines: > /build/dc7x4b3lyfirc87xg1z3c0b0sj4jqzcs-source/wren_utils/tests/binary_reader.cpp(52): error: in "binary_reader/Read": check n == 1234 has failed [-771489792 != 1234] > /build/dc7x4b3lyfirc87xg1z3c0b0sj4jqzcs-source/wren_utils/tests/binary_reader.cpp(52): error: in "binary_reader/Read": check n == 1234 has failed [-771489792 != 1234] > /build/dc7x4b3lyfirc87xg1z3c0b0sj4jqzcs-source/wren_utils/tests/binary_reader.cpp(52): error: in "binary_reader/Read": check n == 1234 has failed [-771489792 != 1234] > > *** 4 failures are detected in the test module "binary_reader" > > > 2/8 Test #2: string_reader .................... Passed 0.02 sec > 3/8 Test #3: enums ............................ Passed 0.01 sec > 4/8 Test #4: vector ........................... Passed 0.01 sec > 5/8 Test #5: matrix ........................... Passed 0.01 sec > 6/8 Test #6: geometry ......................... Passed 0.01 sec > 7/8 Test #8: font ............................. Passed 0.02 sec > 8/8 Test #7: raycast .......................... Passed 0.75 sec > > 88% tests passed, 1 tests failed out of 8 > > Total Test time (real) = 0.77 sec > > The following tests FAILED: > 1 - binary_reader (Failed) > Errors while running CTest > FAILED: [code=8] CMakeFiles/test.util > cd /build/dc7x4b3lyfirc87xg1z3c0b0sj4jqzcs-source/build && /nix/store/c3bm9h7k398cmg00d4rss6hcxkl2zbl2-cmake-4.4.2/bin/ctest > ninja: build stopped: subcommand failed. For full logs, run: nix log /nix/store/9dry1g918vzrsilyschi6zgciymb52hg-wren.drv