warning: unknown setting 'eval-cores' warning: unknown setting 'lazy-trees' this derivation will be built: /nix/store/cxyp80s4ar8ysibr7r17gmms8i8h7ym6-wren.drv error: Cannot build '/nix/store/cxyp80s4ar8ysibr7r17gmms8i8h7ym6-wren.drv'. Reason: builder failed with exit code 8. Output paths: /nix/store/cnrc4kl6g5y91288hqv31cl8zc2j49m0-wren Last 25 log lines: > /build/7glcaph58aisv18ndhpn6h238jfjih0h-source/wren_utils/tests/binary_reader.cpp(52): error: in "binary_reader/Read": check n == 1234 has failed [-771489792 != 1234] > /build/7glcaph58aisv18ndhpn6h238jfjih0h-source/wren_utils/tests/binary_reader.cpp(52): error: in "binary_reader/Read": check n == 1234 has failed [-771489792 != 1234] > /build/7glcaph58aisv18ndhpn6h238jfjih0h-source/wren_utils/tests/binary_reader.cpp(52): error: in "binary_reader/Read": check n == 1234 has failed [-771489792 != 1234] > > *** 4 failures are detected in the test module "binary_reader" > > > 2/8 Test #2: string_reader .................... Passed 0.07 sec > 3/8 Test #3: enums ............................ Passed 0.06 sec > 4/8 Test #4: vector ........................... Passed 0.05 sec > 5/8 Test #5: matrix ........................... Passed 0.04 sec > 6/8 Test #6: geometry ......................... Passed 0.04 sec > 7/8 Test #8: font ............................. Passed 0.09 sec > 8/8 Test #7: raycast .......................... Passed 1.79 sec > > 88% tests passed, 1 tests failed out of 8 > > Total Test time (real) = 1.85 sec > > The following tests FAILED: > 1 - binary_reader (Failed) > Errors while running CTest > FAILED: [code=8] CMakeFiles/test.util > cd /build/7glcaph58aisv18ndhpn6h238jfjih0h-source/build && /nix/store/c3bm9h7k398cmg00d4rss6hcxkl2zbl2-cmake-4.4.2/bin/ctest > ninja: build stopped: subcommand failed. For full logs, run: nix log /nix/store/cxyp80s4ar8ysibr7r17gmms8i8h7ym6-wren.drv